ocio_core_tests linking issue on Ubuntu 10.10


Andrew Hunter <and...@...>
 

Hey everyone,

I've encountered a linker issue on Ubuntu 10.10 with ocio-0.7.0. I was
wondering if anyone could shed some light on whats going on?


Linking CXX executable ocio_core_tests
/usr/lib/gcc/x86_64-linux-gnu/4.4.5/../../../../lib/crt1.o: In
function `_start':
(.text+0x20): undefined reference to `main'
collect2: ld returned 1 exit status
make[2]: *** [src/core_tests/ocio_core_tests] Error 1
make[1]: *** [src/core_tests/CMakeFiles/ocio_core_tests.dir/all] Error 2
make: *** [all] Error 2

Has anyone else been able to successfully build 0.7 on Ubuntu?

Cheers,

Andrew

Join ocio-dev@lists.aswf.io to automatically receive all group messages.